{"text_format":"1","workbook":"xlsx","n_sheets":7,"sheets":["Overview & Instructions","Organizations","MBE Maturity Index","MBE Lexicon","Assessment Charts","Score Summary","Peer Comments"],"not_rendered":{"charts":6,"images":4,"macros":1,"external_links":0,"defined_names":11,"comments":1,"pivot_tables":0},"unopened":[],"bounds":{"document_bytes":16777216,"sheet_cells":100000,"rows_first":2000,"rows_last":500,"rows_between":2000,"halvings":0,"cell_chars":16384,"cell_head_chars":4096},"cells_cut":0,"cells_raw":0,"read":"whole","date_system":"1900"}

{"sheet":"Overview & Instructions","index":0,"n_rows":123,"n_cols":4,"rows_kept":123,"cut":false,"hidden":false,"merged":[[119,1,119,15],[67,1,69,1],[110,1,110,15],[56,1,56,19],[57,1,57,19],[108,1,108,15]]}
["Overview and Instructions for Model-Based Enterprise (MBE) Maturity Index"]
[null,"The NSE MBE Maturity Index is a rubric-like tool that an organization uses to assess itself as, and facilitates its transition to, a Model-Based Enterprise (MBE). "]
[null,null,"The intent of this index is to allow an organization to assess their MBE maturity and to identify distinctive steps along their MBE implementation journey. In other words, it identifies the gap from where you are to where you want to be. "]
[null,null,null,"There is no assumption that higher levels of maturity are necessarily better for your organization under assessment."]
[null,null,"The index provides a common point of reference for MBE communication.  It establishes a common context and a common language: the MBE lexicon."]
[null,null,"Through broad categories of activities, topics within a category, and facets of a topic, this tool shows a progression towards becoming more digital, better integrated, and more automated."]
[null,null,"The index is designed to allow an organization to identify different levels of maturity for each of the categories, topics, and facets at three different as-is ratings (i.e., capability, readiness, and adoption). "]
[null,null,"Results from this assessment will allow your organization to tailor an MBE roadmap of where you want your organization to be in some future state. Then this roadmap can be used to develop an MBE implementation plan."]
[null,null,"** There is no requirement to assess all the facets, nor is there a requirement to use all three of the As-is rating areas.  Assessors should complete only those parts of the Index that provide value to the organization under assessment."]
[]
{"$rows_left_out":114}
{"sheet":"Organizations","index":1,"n_rows":53,"n_cols":12,"rows_kept":53,"cut":false,"hidden":false,"merged":[[8,1,8,5],[7,8,7,11],[8,8,8,11],[4,1,4,5],[4,8,4,11],[5,1,5,5],[5,8,5,11],[6,1,6,5],[6,8,6,11],[7,1,7,5],[1,1,1,5],[1,7,1,11],[2,1,2,5],[2,8,2,11],[3,1,3,5],[3,8,3,11]]}
[]
[null,"How to Identify The Organizations Within Your Enterprise",null,null,null,null,null,"Term Definitions for Convenience (also referenced within the MBE Lexicon worksheet):"]
[null,"The terms at the tops of the lists shown below are used throughout the index, usually to indicate the scope of a particular facet.",null,null,null,null,null,"Organization",{"$f":"_xlfn.XLOOKUP(H3,'MBE Lexicon'!B:B,'MBE Lexicon'!C:C,NA(),0,1)","v":"An autonomous group of people who work together for a common purpose of activities."}]
[null,"Typically, as the maturity score increases, the particular facet expands in scope to include more organizations.",null,null,null,null,null,"Organization Under Assessment",{"$f":"_xlfn.XLOOKUP(H4,'MBE Lexicon'!B:B,'MBE Lexicon'!C:C,NA(),0,1)","v":"The organization that is the subject of this assessment."}]
[null,"This sheet is a place to list those organizations that are, or may become, part of your Model-Based Enterprise.",null,null,null,null,null,"Organization, Peer",{"$f":"_xlfn.XLOOKUP(H5,'MBE Lexicon'!B:B,'MBE Lexicon'!C:C,NA(),0,1)","v":"An organization that is of equal standing with the OUA under the same Supra-Organization."}]
[null,"Fill out light blue cells in columns 1, 2, 3, and 5 below.  (See Term Definitions for Convenience)",null,null,null,null,null,"Organization, Supra",{"$f":"_xlfn.XLOOKUP(H6,'MBE Lexicon'!B:B,'MBE Lexicon'!C:C,NA(),0,1)","v":"An organization that is hierarchically above the OUA and Peer-Organizations."}]
[null,"The light orange cells in columns 4 and 6, auto-populate to demonstrate that the Enterprise and Extended Enterprise are a combination from others.",null,null,null,null,null,"Enterprise",{"$f":"_xlfn.XLOOKUP(H7,'MBE Lexicon'!B:B,'MBE Lexicon'!C:C,NA(),0,1)","v":"The organization that comprises the OUA, Peer-Organizations, and Supra-Organization."}]
[null,"Optionally, fill out the blue cell above list 4 if your Enterprise has an explicit name. This will override the combination of the prior lists.",null,null,null,null,null,"Organization, Extended",{"$f":"_xlfn.XLOOKUP(H8,'MBE Lexicon'!B:B,'MBE Lexicon'!C:C,NA(),0,1)","v":"An organization outside of the Enterprise (e.g., supplier, customer) but coordinated with."}]
[null,"The organizational related definitions from the MBE Lexicon are repeated to the right for convenience.",null,null,null,null,null,"Enterprise, Extended",{"$f":"_xlfn.XLOOKUP(H9,'MBE Lexicon'!B:B,'MBE Lexicon'!C:C,NA(),0,1)","v":"The group of organizations comprised of the Enterprise and Extended Organizations."}]
[]
{"$rows_left_out":44}
{"sheet":"MBE Maturity Index","index":2,"n_rows":175,"n_cols":22,"rows_kept":175,"cut":false,"hidden":false,"merged":[[0,0,0,2],[69,1,69,4],[79,1,79,4],[83,1,83,4],[87,1,87,4],[18,1,18,4],[22,1,22,4],[29,1,29,4],[33,1,33,4],[41,1,41,4],[39,0,39,2],[44,1,44,4],[52,1,52,4],[60,1,60,4],[64,1,64,4],[56,1,56,4],[3,20,3,21],[2,0,2,2],[1,0,1,2],[1,6,1,10],[2,6,2,10],[1,11,1,12],[2,11,2,12],[1,14,1,16],[2,14,2,16],[1,20,1,21],[2,20,2,21],[2,3,2,4],[1,3,1,4],[1,17,1,19],[2,17,2,19],[3,15,3,17],[142,1,142,4],[72,0,72,2],[117,1,117,4],[121,1,121,4],[126,1,126,4],[130,1,130,4],[134,1,134,4],[98,1,98,4],[101,1,101,4],[108,1,108,4],[113,1,113,4],[106,0,106,2],[107,0,107,2],[74,1,74,4],[92,1,92,4],[163,1,163,4],[170,1,170,4],[3,2,3,12],[40,0,40,2],[6,0,6,2],[4,0,5,2],[7,1,7,4],[9,1,9,4],[12,1,12,4],[73,0,73,2],[138,0,138,2],[137,0,137,2],[157,1,157,4],[146,1,146,4],[151,1,151,4],[139,1,139,4]]}
["MBE Category / Topic / Facet / (Context)",null,null,"Description: How the organization . . .","Transition: As maturity increases, the organization's . . .",null,"Drawing-Centric \n(L0)","Drawing \nModel-Centric \n(L1)","Validated \nModel-Centric \n(L2)","Formalized \nModel-Based Definition (L3)","Trusted \nModel-Based Definition (L4)","Integrated \nModel-Based Enterprise (L5)","Extended \nModel-Based Enterprise (L6)",null,null,"AS-IS Level: Capability","AS-IS Level: Readiness","AS-IS Level: Adoption","TO-BE Level: Target",null,"POC","Comment"]
["Assessment Identifier (AID):",null,null,"Organization under assessment (OUA):",null,null,"Description of Environment:",null,null,null,null,"Assessor:",null,null,"Assessment Date:",null,null,"Target Date/Event:",null,null,"Version of Assessment:"]
[]
[null,null,"NSE MBE Maturity Index Rev: C.1",null,null,null,null,null,null,null,null,null,null,null,null,"AS-IS Level",null,null,"TO-BE Level",null,"Assessor comments below."]
["       Maturity Level Name\n                                 Level #\n\n\n\n\n\nCategories (e.g., C1)\n└─Topics (e.g., T3) \n   └─Facets (e.g., F2)",null,null,null,null,null,"Drawing-Centric","Drawing Model-Centric","Validated Model-Centric","Formalized Model-Based Definition","Trusted Model-Based Definition","Digitial Integrated Model-Based Enterprise","Extended Model-Based Enterprise","Weight Factor for Topic/Facet\n[0,2,5,8,10]",null,"Capability: Tools are Available?","Readiness: Processes are Ready?","Adoption: People are Using?","Target Adoption",null,"POC","Comment"]
[null,null,null,"Description: How the organization . . .","Transition: As MBE maturity increases, the organization's . . .",null,"L0","L1","L2","L3","L4","L5","L6",null,null,{"$f":"IF(COUNT(P7,P41,P74,P108,P139)=0,\"N/A\",SUM(IF(P7<>\"N/A\",P7*$N7,0),IF(P41<>\"N/A\",P41*$N41,0),IF(P74<>\"N/A\",P74*$N74,0),IF(P108<>\"N/A\",P108*$N108,0),IF(P139<>\"N/A\",P139*$N139,0))/SUM(IF(P7<>\"N/A\",$N7,0),IF(P41<>\"N/A\",$N41,0),IF(P74<>\"N/A\",$N74,0),IF(P108<>\"N/A\",$N108,0),IF(P139<>\"N/A\",$N139,0)))","v":"N/A"},{"$f":"IF(COUNT(Q7,Q41,Q74,Q108,Q139)=0,\"N/A\",SUM(IF(Q7<>\"N/A\",Q7*$N7,0),IF(Q41<>\"N/A\",Q41*$N41,0),IF(Q74<>\"N/A\",Q74*$N74,0),IF(Q108<>\"N/A\",Q108*$N108,0),IF(Q139<>\"N/A\",Q139*$N139,0))/SUM(IF(Q7<>\"N/A\",$N7,0),IF(Q41<>\"N/A\",$N41,0),IF(Q74<>\"N/A\",$N74,0),IF(Q108<>\"N/A\",$N108,0),IF(Q139<>\"N/A\",$N139,0)))","v":"N/A"},{"$f":"IF(COUNT(R7,R41,R74,R108,R139)=0,\"N/A\",SUM(IF(R7<>\"N/A\",R7*$N7,0),IF(R41<>\"N/A\",R41*$N41,0),IF(R74<>\"N/A\",R74*$N74,0),IF(R108<>\"N/A\",R108*$N108,0),IF(R139<>\"N/A\",R139*$N139,0))/SUM(IF(R7<>\"N/A\",$N7,0),IF(R41<>\"N/A\",$N41,0),IF(R74<>\"N/A\",$N74,0),IF(R108<>\"N/A\",$N108,0),IF(R139<>\"N/A\",$N139,0)))","v":"N/A"},{"$f":"IF(COUNT(S7,S41,S74,S108,S139)=0,\"N/A\",SUM(IF(S7<>\"N/A\",S7*$N7,0),IF(S41<>\"N/A\",S41*$N41,0),IF(S74<>\"N/A\",S74*$N74,0),IF(S108<>\"N/A\",S108*$N108,0),IF(S139<>\"N/A\",S139*$N139,0))/SUM(IF(S7<>\"N/A\",$N7,0),IF(S41<>\"N/A\",$N41,0),IF(S74<>\"N/A\",$N74,0),IF(S108<>\"N/A\",$N108,0),IF(S139<>\"N/A\",$N139,0)))","v":"N/A"}]
["C1: Product Design Activities",null,null,"Activities involved in designing the product and preparing product definition.","Complete product definition becomes a product definition dataset with a trusted model-based definition model.",null,"2D Drawings and documents used for all activities","2D Drawings sourced from 3D models; Complete product definition requires additional support documents","2D Drawings and other derivatives sourced from validated 3D model; Complete product definition requires additional support documents","3DIV drawings and other model derivatives derived from MBD Models.; Complete product definition includes additional support artifacts","Certified MBD models are authorized with derivative models and 3DIV drawings derived from MBD models; Complete product definition includes additional support artifacts.","Complete product definition dataset (PDD) containing a MBD model and other support artifacts made useable for all lifecycle activities throughout Enterprise.","Complete product definition system model made useable for all lifecycle activities.",4,null,{"$f":"IF(COUNT(P8,P10,P13,P19,P23,P30,P34)=0,\"N/A\",SUM(IF(P8<>\"N/A\",P8*$N8,0),IF(P10<>\"N/A\",P10*$N10,0),IF(P13<>\"N/A\",P13*$N13,0),IF(P19<>\"N/A\",P19*$N19,0),IF(P23<>\"N/A\",P23*$N23,0),IF(P30<>\"N/A\",P30*$N30,0),IF(P34<>\"N/A\",P34*$N34,0))/SUM(IF(P8<>\"N/A\",$N8,0),IF(P10<>\"N/A\",$N10,0),IF(P13<>\"N/A\",$N13,0),IF(P19<>\"N/A\",$N19,0),IF(P23<>\"N/A\",$N23,0),IF(P30<>\"N/A\",$N30,0),IF(P34<>\"N/A\",$N34,0)))","v":"N/A"},{"$f":"IF(COUNT(Q8,Q10,Q13,Q19,Q23,Q30,Q34)=0,\"N/A\",SUM(IF(Q8<>\"N/A\",Q8*$N8,0),IF(Q10<>\"N/A\",Q10*$N10,0),IF(Q13<>\"N/A\",Q13*$N13,0),IF(Q19<>\"N/A\",Q19*$N19,0),IF(Q23<>\"N/A\",Q23*$N23,0),IF(Q30<>\"N/A\",Q30*$N30,0),IF(Q34<>\"N/A\",Q34*$N34,0))/SUM(IF(Q8<>\"N/A\",$N8,0),IF(Q10<>\"N/A\",$N10,0),IF(Q13<>\"N/A\",$N13,0),IF(Q19<>\"N/A\",$N19,0),IF(Q23<>\"N/A\",$N23,0),IF(Q30<>\"N/A\",$N30,0),IF(Q34<>\"N/A\",$N34,0)))","v":"N/A"},{"$f":"IF(COUNT(R8,R10,R13,R19,R23,R30,R34)=0,\"N/A\",SUM(IF(R8<>\"N/A\",R8*$N8,0),IF(R10<>\"N/A\",R10*$N10,0),IF(R13<>\"N/A\",R13*$N13,0),IF(R19<>\"N/A\",R19*$N19,0),IF(R23<>\"N/A\",R23*$N23,0),IF(R30<>\"N/A\",R30*$N30,0),IF(R34<>\"N/A\",R34*$N34,0))/SUM(IF(R8<>\"N/A\",$N8,0),IF(R10<>\"N/A\",$N10,0),IF(R13<>\"N/A\",$N13,0),IF(R19<>\"N/A\",$N19,0),IF(R23<>\"N/A\",$N23,0),IF(R30<>\"N/A\",$N30,0),IF(R34<>\"N/A\",$N34,0)))","v":"N/A"},{"$f":"IF(COUNT(S8,S10,S13,S19,S23,S30,S34)=0,\"N/A\",SUM(IF(S8<>\"N/A\",S8*$N8,0),IF(S10<>\"N/A\",S10*$N10,0),IF(S13<>\"N/A\",S13*$N13,0),IF(S19<>\"N/A\",S19*$N19,0),IF(S23<>\"N/A\",S23*$N23,0),IF(S30<>\"N/A\",S30*$N30,0),IF(S34<>\"N/A\",S34*$N34,0))/SUM(IF(S8<>\"N/A\",$N8,0),IF(S10<>\"N/A\",$N10,0),IF(S13<>\"N/A\",$N13,0),IF(S19<>\"N/A\",$N19,0),IF(S23<>\"N/A\",$N23,0),IF(S30<>\"N/A\",$N30,0),IF(S34<>\"N/A\",$N34,0)))","v":"N/A"}]
[null,"T1: Product Definition Authorization",null,null,null,null,null,null,null,null,null,null,null,4,null,{"$f":"IF(COUNTIF(P9:P9,\"N/A\")=ROWS(P9:P9),\"N/A\",P9)","v":"N/A"},{"$f":"IF(COUNTIF(Q9:Q9,\"N/A\")=ROWS(Q9:Q9),\"N/A\",Q9)","v":"N/A"},{"$f":"IF(COUNTIF(R9:R9,\"N/A\")=ROWS(R9:R9),\"N/A\",R9)","v":"N/A"},{"$f":"IF(COUNTIF(S9:S9,\"N/A\")=ROWS(S9:S9),\"N/A\",S9)","v":"N/A"}]
[null,null,"F1: Authorized Product Definition","Identifies the complete authorized product definition (i.e. legal definition) set.","Collects the complete product definition as a MBD model-based product definition dataset PDD. The PDD becomes the product definition authority.",null,"Paper document set w/ 2D graphical drawing(s) and support documents","Electronic document set w/ 2D graphical drawing(s) and support documents. Models may be provided as courtesy","Electronic document set w/2D graphical drawing from 3D model, support documents and support model","Electronic document set w/ graphical drawing (e.g. 3D Interactive Viewable) from MBD model, support documents and support model(s)","Electronic document set w/ a MBD model, human-readable support drawing, support documents and support model(s)","Product definition dataset (PDD) containing a MBD model and all related support product definition artifacts","Product definition data model communicating a system and all product definition artifacts along with their relationships.",4,null,"N/A","N/A","N/A","N/A"]
[null,"T2: Product Requirements Association",null,null,null,null,null,null,null,null,null,null,null,4,null,{"$f":"IF(COUNTIF(P11:P12,\"N/A\")=ROWS(P11:P12),\"N/A\",(SUMPRODUCT(--(P11:P12<>\"N/A\"),$N11:$N12,P11:P12))/SUMIF(P11:P12,\"<>N/A\",$N11:$N12))","v":"N/A"},{"$f":"IF(COUNTIF(Q11:Q12,\"N/A\")=ROWS(Q11:Q12),\"N/A\",(SUMPRODUCT(--(Q11:Q12<>\"N/A\"),$N11:$N12,Q11:Q12))/SUMIF(Q11:Q12,\"<>N/A\",$N11:$N12))","v":"N/A"},{"$f":"IF(COUNTIF(R11:R12,\"N/A\")=ROWS(R11:R12),\"N/A\",(SUMPRODUCT(--(R11:R12<>\"N/A\"),$N11:$N12,R11:R12))/SUMIF(R11:R12,\"<>N/A\",$N11:$N12))","v":"N/A"},{"$f":"IF(COUNTIF(S11:S12,\"N/A\")=ROWS(S11:S12),\"N/A\",(SUMPRODUCT(--(S11:S12<>\"N/A\"),$N11:$N12,S11:S12))/SUMIF(S11:S12,\"<>N/A\",$N11:$N12))","v":"N/A"}]
{"$rows_left_out":166}
{"sheet":"MBE Lexicon","index":3,"n_rows":217,"n_cols":6,"rows_kept":217,"cut":false,"hidden":false,"merged":[[215,1,215,4]]}
["Abbrev.","Term","Definition, Normalized","Definition, Specialized (editable)","Organization Comments (Add your comments here)","Lexicon Clarifications"]
["3DIV","3D Interactive Viewable","A three-dimensional, derivative viewable that is intended for human interaction and is published in a ubiquitous format (e.g., html, .pdf)."]
[null,"Activities, Enterprise Enabling","An MBE Maturity Index category of activities that enable an organization to act as an MBE, but may not directly add value to products."]
[null,"Activities, Product Data / Lifecycle Management","An MBE Maturity Index category of activities involved in managing and interrelating product data."]
[null,"Activities, Product Design","An MBE Maturity Index category of activities involved in designing the product and preparing the product definition."]
[null,"Activities, Product Manufacturing","An MBE Maturity Index category of activities involved in fabricating (e.g., manufacturing, assembling) products."]
[null,"Activities, Product Quality","An MBE Maturity Index category of activities involved in verifying, testing, inspecting, and accepting products."]
[null,"Activities, Product Sustainment ","An MBE Maturity Index category of activities involved in servicing/sustaining products."]
[null,"Activities, Systems Engineering","An MBE Maturity Index category of activities involved in system engineering of products."]
[null,"Annotation","Visible, non-shape information contained in a 3D model.","[ASME Y14.41-2019, Annotation] visible dimensions, tolerances, notes, text, or symbols.  "]
{"$rows_left_out":208}
{"sheet":"Assessment Charts","index":4,"n_rows":125,"n_cols":1,"rows_kept":125,"cut":false,"hidden":false,"merged":[]}
["Model-Based Enterprise"]
[]
[]
[]
[]
[]
[]
[]
[]
[]
{"$rows_left_out":116}
{"sheet":"Score Summary","index":5,"n_rows":176,"n_cols":22,"rows_kept":176,"cut":false,"hidden":false,"merged":[[0,19,0,21]]}
["Do Not Modify - Used for Radar Charts",null,null,null,null,null,null,null,null,null,"Score Summary by Facet",null,null,null,null,null,null,null,null,"Score Gaps"]
["MBE","Category",null,"Max Scale","Target","Capability","Readiness","Adoption",null,null,"MBE Category",null,null,null,"Capability","Readiness","Adoption","Target",null,"C-R","R-A","T-A"]
[null,{"$f":"'MBE Maturity Index'!A7","v":"C1: Product Design Activities"},null,6,{"$f":"'MBE Maturity Index'!S7","v":"N/A"},{"$f":"'MBE Maturity Index'!P7","v":"N/A"},{"$f":"'MBE Maturity Index'!Q7","v":"N/A"},{"$f":"'MBE Maturity Index'!R7","v":"N/A"},null,null,null,{"$f":"'MBE Maturity Index'!A7","v":"C1: Product Design Activities"},null,null,{"$f":"F3","v":"N/A"},"N/A","N/A",{"$f":"E3","v":"N/A"},null,{"$f":"O3-P3","v":{"$error":"#VALUE!"}},{"$error":"#VALUE!"},{"$f":"R3-Q3","v":{"$error":"#VALUE!"}}]
[null,{"$f":"'MBE Maturity Index'!A41","v":"C2: Product Data/Lifecycle Management Activities"},null,6,{"$f":"'MBE Maturity Index'!S41","v":"N/A"},{"$f":"'MBE Maturity Index'!P41","v":"N/A"},{"$f":"'MBE Maturity Index'!Q41","v":"N/A"},{"$f":"'MBE Maturity Index'!R41","v":"N/A"},null,null,null,{"$f":"'MBE Maturity Index'!A41","v":"C2: Product Data/Lifecycle Management Activities"},null,null,"N/A","N/A","N/A",{"$f":"E4","v":"N/A"},null,{"$error":"#VALUE!"},{"$error":"#VALUE!"},{"$f":"R4-Q4","v":{"$error":"#VALUE!"}}]
[null,{"$f":"'MBE Maturity Index'!A74","v":"C3: Product Manufacturing Activities"},null,6,{"$f":"'MBE Maturity Index'!S74","v":"N/A"},{"$f":"'MBE Maturity Index'!P74","v":"N/A"},{"$f":"'MBE Maturity Index'!Q74","v":"N/A"},{"$f":"'MBE Maturity Index'!R74","v":"N/A"},null,null,null,{"$f":"'MBE Maturity Index'!A74","v":"C3: Product Manufacturing Activities"},null,null,"N/A","N/A","N/A",{"$f":"E5","v":"N/A"},null,{"$error":"#VALUE!"},{"$error":"#VALUE!"},{"$f":"R5-Q5","v":{"$error":"#VALUE!"}}]
[null,{"$f":"'MBE Maturity Index'!A108","v":"C4: Product Quality Activities "},null,6,{"$f":"'MBE Maturity Index'!S108","v":"N/A"},{"$f":"'MBE Maturity Index'!P108","v":"N/A"},{"$f":"'MBE Maturity Index'!Q108","v":"N/A"},{"$f":"'MBE Maturity Index'!R108","v":"N/A"},null,null,null,{"$f":"$B$6","v":"C4: Product Quality Activities "},null,null,"N/A","N/A","N/A",{"$f":"E6","v":"N/A"},null,{"$error":"#VALUE!"},{"$error":"#VALUE!"},{"$f":"R6-Q6","v":{"$error":"#VALUE!"}}]
[null,{"$f":"'MBE Maturity Index'!A139","v":"C5: Enterprise Enabling Activities"},null,6,{"$f":"'MBE Maturity Index'!S139","v":"N/A"},{"$f":"'MBE Maturity Index'!P139","v":"N/A"},{"$f":"'MBE Maturity Index'!Q139","v":"N/A"},{"$f":"'MBE Maturity Index'!R139","v":"N/A"},null,null,null,{"$f":"$B$7","v":"C5: Enterprise Enabling Activities"},null,null,"N/A","N/A","N/A",{"$f":"E7","v":"N/A"},null,{"$error":"#VALUE!"},{"$error":"#VALUE!"},{"$f":"R7-Q7","v":{"$error":"#VALUE!"}}]
[]
[{"$f":"B3","v":"C1: Product Design Activities"},null,null,"Max Scale","Target","Capability","Readiness","Adoption",null,null,{"$f":"L3","v":"C1: Product Design Activities"},null,null,null,"Capability","Readiness","Adoption","Target",null,"C-R","R-A","T-A"]
[null,{"$f":"'MBE Maturity Index'!B8","v":"T1: Product Definition Authorization"},null,6,{"$f":"'MBE Maturity Index'!S8","v":"N/A"},{"$f":"'MBE Maturity Index'!P8","v":"N/A"},{"$f":"'MBE Maturity Index'!Q8","v":"N/A"},{"$f":"'MBE Maturity Index'!R8","v":"N/A"},null,null,null,{"$f":"B10","v":"T1: Product Definition Authorization"},null,null,{"$f":"'MBE Maturity Index'!P8","v":"N/A"},{"$f":"'MBE Maturity Index'!Q8","v":"N/A"},{"$f":"'MBE Maturity Index'!R8","v":"N/A"},{"$f":"'MBE Maturity Index'!S8","v":"N/A"},null,{"$f":"O10-P10","v":{"$error":"#VALUE!"}},{"$error":"#VALUE!"},{"$f":"R10-Q10","v":{"$error":"#VALUE!"}}]
{"$rows_left_out":167}
{"sheet":"Peer Comments","index":6,"n_rows":83,"n_cols":9,"rows_kept":83,"cut":false,"hidden":false,"merged":[]}
["Peer Reviewer:","[peer reviewers name]",null,null,null,null,null,"MBE Maturity Index Task Group "]
["Comment ID","Comment","Worksheet","Cell in Index\n(e.g., C1; T3; F1; L5)","Source","Date",null,"Response","Date"]
[1,"Many people ask, what is supplemental data in C2:T4:F3?","MBE Lexicon","C2:T4:F3","Sarah Hale",20220131,null,"Added \"Data, Supplemental\" with definition to MBE Lexicon",20220314]
[2,"In contrast to a duplicate copy from one disconnected systems to another, need a term (e.g., \"controlled copy\") that addresses the coping of a digital artifact from an authoritative source with  provenance. ","MBE Lexicon",null,"Curtis Brown",20220228,null,"Added \"Copy, Controlled\" with definition to MBE Lexicon",20220321]
[]
[]
[]
[]
[]
[]
{"$rows_left_out":73}