{"text_format":"1","workbook":"xlsx","n_sheets":12,"sheets":["INPUT","channeling cal","debye calc","FPS","FRS","P(th,m)","stereographs","tables","bcc atoms","fcc atoms","diamond atoms","b"],"not_rendered":{"charts":1,"images":46,"macros":1,"external_links":1,"defined_names":1,"comments":0,"pivot_tables":0},"unopened":[],"bounds":{"document_bytes":16777216,"sheet_cells":100000,"rows_first":2000,"rows_last":500,"rows_between":2000,"halvings":0,"cell_chars":16384,"cell_head_chars":4096},"cells_cut":0,"cells_raw":0,"read":"whole","date_system":"1900"}

{"sheet":"INPUT","index":0,"n_rows":23,"n_cols":17,"rows_kept":23,"cut":false,"hidden":false,"merged":[]}
[null,"Calucation of channeling half-angles"]
[null,"enter parameters","in yellow cells only"]
[]
[]
[]
[null,"Beam",null,null,null,null,null,null,"Target",null,null,null,"axis factor fa=",{"$f":"+'channeling cal'!G13","v":1.7320508075688772}]
[null,null,null,null,null,null,null,null,null,null,null,null,null,null,null,null,"plane factor fp="]
[null,"atomic number of projectile","Z₁",35,{"$f":"+'channeling cal'!D5","v":"Br"},null,null,null,"atomic # of target","Z₂",13,{"$f":"+'channeling cal'!D6","v":"Al"},null,null,null,null,{"$f":"+'channeling cal'!G49","v":0.57735026918962584}]
[null,"Energy of projectile","E",0.04,"MeV",null,null,null,"atomic weight of target","M2",{"$f":"+'channeling cal'!C7","v":26.981539999999999},"amu"]
[null,null,null,null,null,null,null,null,"conventional cell size","cc",null,"Ang",{"$f":"+'channeling cal'!C9","v":4.0500000000000007}]
[null,null,null,null,null,null,null,null,"lattice  ",null,{"$f":"+'channeling cal'!C10","v":"fcc"}]
[null,null,null,null,null,null,null,null,null,null,"uvw or hkl"]
[null,null,null,null,null,null,null,null,"Miller indeces",null,111]
[null,null,null,null,null,null,null,null,"Room Temp","T",293,"K"]
[null,null,null,null,null,null,null,null,"density","rho",{"$f":"INDEX(tables!$K$8:$Q$99,K8,4)","v":2.7},"g/cm3"]
[]
[]
[null,"axial Ψ1/2",{"$f":"+'channeling cal'!C36","v":3.431230763777088},"deg"]
[null,"planar Ψ1/2",{"$f":"+'channeling cal'!C62","v":4.2991292290740066},"deg",null,null,"overlayer","Zo",14,{"$f":"+'channeling cal'!Q22","v":"Si"}]
[null,null,null,null,null,null,null,"Mo",{"$f":"+'channeling cal'!P23","v":28.0855},"amu"]
[null,"axial χ-min",{"$f":"+'channeling cal'!$P$40","v":0.18318060178721671},"w/overlayer",null,null,"density","rho-o",{"$f":"+'channeling cal'!P25","v":2.33},"g/cm3"]
[null,"axial χ-min",{"$f":"+'channeling cal'!P8","v":0.18318060178721671},"w/o overlayer",null,null,"thickness of overlayer","t",1,"A"]
[null,"planar χ-min",{"$f":"+'channeling cal'!P49","v":0.17042399603803085},"w/o overlayer"]

{"sheet":"channeling cal","index":1,"n_rows":62,"n_cols":22,"rows_kept":62,"cut":false,"hidden":false,"merged":[]}
[]
["axial channeling",null,"1/2 angles",null,null,null,null,null,null,null,null,null,null,"Chi-mins"]
[null,null,null,null,null,null,null,null,null,null,null,null,null,"AXIAL"]
["e^2",null,{"$f":"0.0000144","v":1.4399999999999999E-5},"MeV-A"]
["atomic number of projectile","Z₁",{"$f":"+INPUT!D8","v":35},{"$f":"INDEX(tables!$K$8:$Q$99,'channeling cal'!C5,1)","v":"Br"},null,null,null,null,null,null,null,null,null,"Chi-min","Lindhard",{"$f":"C54*C14*3.14159*(2*C23^2+C18^2)","v":8.2346873563574216E-2},null,"Lindhard"]
["atomic # of target","Z₂",{"$f":"+INPUT!K8","v":13},{"$f":"INDEX(tables!$K$8:$Q$99,'channeling cal'!C6,1)","v":"Al"},null,null,null,null,null,null,null,null,null,null,null,null,null,"A15.7"]
["atomic weight of target","M2",{"$f":"INDEX(tables!$K$8:$Q$99,'channeling cal'!C6,3)","v":26.981539999999999},"amu",null,null,null,null,null,null,null,null,null,"Xh",null,{"$f":"126*$C$23/($C$36*$C$14)","v":0.55273289746079046},null,"Barrett"]
["Energy of projectile","E",{"$f":"+INPUT!D9","v":0.04},"MeV",null,null,null,null,null,null,null,null,null,"Chi-min","Barrett",{"$f":"18.8*$C$54*$C$14*$C$23^2*SQRT(1+1/$P$7^2)","v":0.18318060178721671},null,"A15.8"]
["conventional cell size","cc",{"$f":"INDEX(tables!$K$8:$Q$99,$C$6,7)*10","v":4.0500000000000007},"Ang","p647 Black IBA Handbook"]
["lattice  ",null,{"$f":"INDEX(tables!$K$8:$Q$99,$C$6,5)","v":"fcc"}]
[null,null,"uvw or hkl","u","v","w",null,null,null,null,null,null,null,"Chi-min","Barrett",{"$f":"18.8*C54*C14*C23^2","v":8.8614355987004845E-2},null,"A15.9",null,null,null,"same as last at high E?"]
["Miller indeces",null,{"$f":"+INPUT!K13","v":111},{"$f":"INT(C12/100)","v":1},{"$f":"INT((C12-100*D12)/10)","v":1},{"$f":"+INT(C12-100*D12-10*E12)","v":1}]
["axis lattice factor","fa",null,null,null,null,1.7320508075688772,null,null,null,null,null,null,"Xh",null,{"$f":"63*$C$23/($C$36*$C$14)","v":0.27636644873039523},null,"Mayer"]
["lattice spacing","d",{"$f":"+C9*G13","v":7.0148057706539539},"Ang",null,null,null,null,null,null,null,null,null,"CHi-min","Meyer",{"$f":"17*$C$54*$C$14*$C$23^2*SQRT(1+1/$P$7^2)","v":0.16564203353099385},null,"p.654"]
[]
["Following the EQUATIONSL FOR CHANNELING in the IBA Handbook, p645"]
[null,null,"0.4685*C6^-(1/3)",null,null,"0.4685/(C5^(1/2)+C6^(1/2))^(2/3)",null,null,"This TF screening gives best results",null,null,null,null,"w/overlayer"]
["thomas fermi screening length","a",{"$f":"0.4685*C6^-(1/3)","v":0.19924853847758092},"Ang",null,{"$f":"0.4685/(C5^(1/2)+C6^(1/2))^(2/3)","v":0.10428824575328724},null,null,{"$f":"(9*3.14^2/128)^0.333*0.53/(C5^0.666+C6^0.666)^0.5","v":0.11657823957132486},null,null,null,null,"overlayer"]
["Debye Temp","theat-D",{"$f":"INDEX(tables!$K$8:$Q$99,$C$6,6)","v":390},"K","p647 Black IBA Handbook",null,null,null,null,null,null,null,null," ","Z₁",{"$f":"+C5","v":35},{"$f":"INDEX(tables!$K$8:$Q$99,'channeling cal'!P19,1)","v":"Br"}]
["Room Temp","T",{"$f":"+INPUT!K14","v":293},"K",null,null,null,null,null,null,null,null,null,null,"Z₂",{"$f":"+C6","v":13},{"$f":"INDEX(tables!$K$8:$Q$99,'channeling cal'!P20,1)","v":"Al"}]
["x\"=Theta-D/T","x\"",{"$f":"C19/C20","v":1.3310580204778157},null,null,null,null,null,null,null,null,null,null,null,"a",{"$f":"+I18","v":0.11657823957132486},"A"]
["debye fn","phi-D",{"$f":"+'debye calc'!C28","v":0.73377827265457818},null,null,null,null,null,null,null,null,null,null,null,"Zo",{"$f":"+INPUT!I19","v":14},{"$f":"INDEX(tables!$K$8:$Q$99,'channeling cal'!P22,1)","v":"Si"},"overlayer"]
["rms thermal amplitude","u1",{"$f":"+'debye calc'!B32","v":0.10558697459361684},"Ang","fig. A15.1",null,null,null,null,null,null,null,null,null,"Mo",{"$f":"INDEX(tables!$K$8:$Q$99,'channeling cal'!P22,3)","v":28.0855},"amu"]
[null,null,null,null,null,null,null,null,null,null,null,null,null,null,"E",{"$f":"+C8","v":0.04},"MeV"]
["characteristic axial channeling angle","Ψ₁",{"$f":"0.307*SQRT(C5*C6/C8/C14)","v":12.362498526879071},"deg",null,null,null,null,null,null,null,null,null,null,"rho-o",{"$f":"INDEX(tables!$K$8:$Q$99,$P$22,4)","v":2.33},"g/cm3"]
[null,null,{"$f":"C25/57.3","v":0.2157504105912578},"rad",null,null,null,null,null,null,null,null,null,null,"Nav",6.0229999999999998E+23,"at/mole"]
[null,null,null,null,null,null,null,null,null,null,null,null,null,null,"N ",{"$f":"+P26*P25/P23","v":4.9967385305584727E+22},"atoms/cm3"]
["ratio of a to d","a/d",{"$f":"I18/C14","v":1.6618883456335082E-2},null,null,null,null,null,null,null,null,null,null,null,"N",{"$f":"P27*0.00000001^3","v":4.9967385305584734E-2},"atoms/A3"]
[null,null,null,null,null,null,null,null,null,null,null,null,null,null,"a-o",{"$f":"(9*3.14^2/128)^0.333*0.53/(P19^0.666+P22^0.666)^0.5","v":0.11558592128608777},"A"]
["parameter to use in Frs","x'",{"$f":"1.2*C23/I18","v":1.0868612356667127},null,null,null,null,null,null,null,null,null,null,null,"d",{"$f":"+C14","v":7.0148057706539539},"A"]
{"$rows_left_out":33}
{"sheet":"debye calc","index":2,"n_rows":32,"n_cols":4,"rows_kept":32,"cut":false,"hidden":false,"merged":[]}
["Calculation of u1 - 1D vibrational amplitude"]
[]
["Parameterization of Debye Function"]
[null,"a",1]
[null,"b",4.3]
[]
[]
[]
[]
[]
[]
[]
[]
[]
[]
[]
[]
[]
[]
[]
["Debye fn. PhiD=exp(-x\"/4.3)"]
[]
["Theta-D",{"$f":"+'channeling cal'!C19","v":390},"K","p647 Black IBA Handbook"]
["T",{"$f":"+'channeling cal'!C20","v":293},"K","room temp"]
["x\"=Theta-D/T"]
["x\"",{"$f":"B23/B24","v":1.3310580204778157}]
[null,"x\""]
["debye fn",{"$f":"+B26","v":1.3310580204778157},{"$f":"$C$4*EXP(-B28/$C$5)","v":0.73377827265457818}]
[]
["M2",{"$f":"+'channeling cal'!C7","v":26.981539999999999}]
{"$rows_left_out":3}
{"sheet":"FPS","index":3,"n_rows":101,"n_cols":2,"rows_kept":101,"cut":false,"hidden":false,"merged":[]}
["Parameterization of Fps"]
[]
[]
[]
[]
[]
[]
[]
[]
[]
[]
[]
[]
[]
[]
[]
[]
[]
[]
[]
[]
[]
[]
[]
[]
[]
[]
[]
[]
[]
{"$rows_left_out":72}
{"sheet":"FRS","index":4,"n_rows":39,"n_cols":3,"rows_kept":39,"cut":false,"hidden":false,"merged":[]}
["Parameterization of FRS(x')"]
[]
[null,"a",1.9]
[null,"b",1.2]
[null,"c",0.53]
[]
[]
[]
[]
[]
[]
[]
[]
[]
[]
[]
[]
[]
[]
[]
[]
[]
[]
[]
[]
[]
[]
[]
[]
[]
{"$rows_left_out":10}
{"sheet":"P(th,m)","index":5,"n_rows":68,"n_cols":14,"rows_kept":68,"cut":false,"hidden":false,"merged":[]}
["Parameterization of P(th,m)"]
[]
["P=fexp(-(thc^pa)/a)+(1-f)exp(-thc^pb/b)"]
[]
["so the y intercept P=1"]
[]
["m",5,null,null,null,null,null,null,null,null,null,null,"power law fits"]
["f",0.92,"f",null,null,null,null,null,null,null,null,null,0.318,0.39100000000000001]
["a",35,"a ",null,null,null,null,null,null,null,null,null,1.63,0.82399999999999995]
["pa",2.2000000000000002,"pa",null,null,null,null,null,null,null,null,null,0.97399999999999998,0.28799999999999998]
["b",50,"b",null,null,null,null,null,null,null,null,null,0.67100000000000004,1.242]
["pb",5,"pb",null,null,null,null,null,null,null,null,null,1.6459999999999999,0.372]
[null,null,"f-fit"]
[null,null,"a -fit",null,null,null,null,null,null,null,null,null,1.17,0.41]
["m",{"$f":"+'channeling cal'!P33","v":2.0972297416233525E-3},"pa-fit",null,null,null,null,null,null,null,null,null,0.16,1.8]
["f-fit",{"$f":"+$M8*B$15^$N8","v":2.8522704928106168E-2},"b-fit",null,null,null,null,null,null,null,null,null,0.44,0.64]
["a -fit",{"$f":"+$M$14*B15^$N$14+$M$15*B15^$N$15","v":9.3340896097236142E-2},"pb-fit",null,null,null,null,null,null,null,null,null,4.8000000000000001E-2,2.3199999999999998]
["pa-fit",{"$f":"+$M10*B$15^$N10","v":0.16488950231409702},"para",null,null,null,null,null,null,null,null,null,0.44,0.64]
["b-fit",{"$f":"+$M$16*B15^$N$16+$M$17*B15^$N$17","v":8.497821827487961E-3},null,null,null,null,null,null,null,null,null,null,4.8000000000000001E-2,2.3199999999999998]
["pb-fit",{"$f":"+$M12*B$15^$N12","v":0.16599008443395058}]
[]
[]
["thc"]
[null,"P"]
[0,{"$f":"+B$17*EXP(-($A25^B$18)/B$16)+(1-B$17)*EXP(-($A25^B$20)/B$19)","v":1}]
[0.1,{"$f":"+B$16*EXP(-($A26^B$18)/B$17)+(1-B$16)*EXP(-($A26^B$20)/B$19)","v":1.8719395359458742E-5}]
[0.2,{"$f":"+B$16*EXP(-($A27^B$18)/B$17)+(1-B$16)*EXP(-($A27^B$20)/B$19)","v":7.7073618826657617E-6}]
[0.3,4.3670237367540537E-6]
[0.4,2.8500800558864291E-6]
[0.5,2.018028618645779E-6]
{"$rows_left_out":39}
{"sheet":"stereographs","index":6,"n_rows":0,"n_cols":0,"rows_kept":0,"cut":false,"hidden":false,"merged":[]}

{"sheet":"tables","index":7,"n_rows":99,"n_cols":17,"rows_kept":99,"cut":false,"hidden":false,"merged":[]}
[]
["symbol","Z2","M2","g/cm3","Structure","Debye Temp","Lattice constant",null,null,null,null,null,"amu","g/cm3"]
[{"$f":"INDEX($K$8:$N$99,B3,1)","v":"C"},6,{"$f":"INDEX($K$8:$N$99,B3,3)","v":12.010999999999999},{"$f":"INDEX($K$8:$N$99,B3,4)","v":3.51},"diamond",2000,0.35670000000000002,null,null,null,"target","target","target","target"]
[{"$f":"INDEX($K$8:$N$99,B4,1)","v":"Al"},13,{"$f":"INDEX($K$8:$N$99,B4,3)","v":26.981539999999999},{"$f":"INDEX($K$8:$N$99,B4,4)","v":2.7},"fcc",390,0.40500000000000003,null,null,null,"___________________________________________________________________________________"]
["Si",14,28.0855,2.33,"diamond",543,0.54310000000000003,null,null,null,"element","Z","mass ","density","structure","Debye T","Lattice constant"]
["V",23,50.941499999999998,5.8,"bcc",360,0.3024,null,null,null,"___________________________________________________________________________________"]
["Cr",24,51.996000000000002,7.19,"bcc",485,0.28839999999999999]
["Fe",26,55.847000000000001,7.86,"bcc",420,0.28670000000000001,null,null,null,"H",1,1.0079,8.9899999999999994E-2]
["Ni",28,58.7,8.9,"fcc",425,0.35239999999999999,null,null,null,"He",2,4.0026000000000002,0.1787]
["Cu",29,63.545999999999999,8.9600000000000009,"fcc",315,0.36149999999999999,null,null,null,"Li",3,6.9409999999999998,0.53]
["Ge",32,72.59,5.32,"diamond",290,0.56569999999999998,null,null,null,"Be",4,9.0121599999999997,1.85]
["Nb",41,92.906400000000005,8.5500000000000007,"bcc",275,0.33,null,null,null,"B",5,10.81,2.34]
["Mo",42,95.94,10.199999999999999,"bcc",380,0.31469999999999998,null,null,null,"C",6,12.010999999999999,3.51,"diamond",2000,0.35670000000000002]
["Rh",45,102.9055,12.4,"fcc",340,0.38030000000000003,null,null,null,"N",7,14.0067,1.2509999999999999]
["Pd",46,106.4,12,"fcc",275,0.38900000000000001,null,null,null,"O",8,15.9994,1.429]
["Ag",47,107.86799999999999,10.5,"fcc",215,0.40860000000000002,null,null,null,"F",9,18.998403,1.696]
["Ta",73,180.9479,16.600000000000001,"bcc",245,0.3306,null,null,null,"Ne",10,20.178999999999998,0.90100000000000002]
["W",74,183.85,19.3,"bcc",310,0.3165,null,null,null,"Na",11,22.98977,0.97]
["Pt",78,195.09,21.4,"fcc",225,0.39229999999999998,null,null,null,"Mg",12,24.305,1.74]
["Au",79,196.9665,19.3,"fcc",170,0.4078,null,null,null,"Al",13,26.981539999999999,2.7,"fcc",390,0.40500000000000003]
["Pb",82,207.2,11.4,"fcc",88,0.49509999999999998,null,null,null,"Si",14,28.0855,2.33,"diamond",543,0.54310000000000003]
[null,null,null,null,null,null,null,null,null,null,"P",15,30.973759999999999,1.82]
[null,null,null,null,null,null,null,null,null,null,"S",16,32.06,2.0699999999999998]
[null,null,null,null,null,null,null,null,null,null,"Cl",17,35.453000000000003,3.17]
[null,null,null,null,null,null,null,null,null,null,"Ar",18,39.948,1.784]
[null,null,null,null,null,null,null,null,null,null,"K",19,39.098300000000002,0.86]
[null,null,null,null,null,null,null,null,null,null,"Ca",20,40.08,1.55]
[null,null,null,null,null,null,null,null,null,null,"Sc",21,44.9559,3]
[null,null,null,null,null,null,null,null,null,null,"Ti",22,47.9,4.5]
[null,null,null,null,null,null,null,null,null,null,"V",23,50.941499999999998,5.8,"bcc",360,0.3024]
{"$rows_left_out":70}
{"sheet":"bcc atoms","index":8,"n_rows":191,"n_cols":63,"rows_kept":191,"cut":false,"hidden":false,"merged":[]}
["bcc"]
[]
[]
[]
[]
[]
[]
[]
[]
[null,null,null,null,null,null,null,null,null,null,null,null,null,null,null,null,null,null,null,null,null,null,null,null,null,null,null,null,null,null,null,null,null,null,null,null,null,null,null,null,null,null,null,null,null,null,null,null,null,null,null,null,null,null,null,null,null,null,null,null,5,-5,4]
[]
[]
[]
[null,null,null,null,null,null,null,null,null,null,null,null,"atoms in","axis factor","plane factor"]
[null,null,null,null,null,null,null,null,null,"h","k","l","row",null,"if sum odd 1/2sqrtsumsquares, even 1/sqrtsumsquares"]
[null,null,null,null,null,null,null,null,1,0,0,0,0,null,null,"sum odd?"]
[null,null,null,null,null,null,null,null,2,0,0,1,1,{"$f":"SQRT(J17^2+K17^2+L17^2)/M17","v":1},{"$f":"IF(P17,1/2/SQRT(J17^2+K17^2+L17^2),1/SQRT(J17^2+K17^2+L17^2))","v":0.5},{"$f":"ISODD(J17+K17+L17)","v":true}]
[null,null,null,null,null,null,null,null,3,0,1,0,1,1,0.5,true]
[null,null,null,null,null,null,null,null,4,0,1,1,1,{"$f":"SQRT(J19^2+K19^2+L19^2)/M19","v":1.4142135623730951},{"$f":"IF(P19,1/2/SQRT(J19^2+K19^2+L19^2),1/SQRT(J19^2+K19^2+L19^2))","v":0.70710678118654746},false]
[null,null,null,null,null,null,null,null,5,0,1,2,1,2.2360679774997898,0.22360679774997896,true]
[null,null,null,null,null,null,null,null,6,0,1,3,1,3.1622776601683795,0.31622776601683794,false]
[null,null,null,null,null,null,null,null,7,0,1,4,1,4.1231056256176606,0.12126781251816648,true]
[null,null,null,null,null,null,null,null,8,0,1,5,1,{"$f":"SQRT(J23^2+K23^2+L23^2)/M23","v":5.0990195135927845},0.19611613513818404,false]
[null,null,null,null,null,null,null,null,9,0,2,1,1,2.2360679774997898,0.22360679774997896,true]
[null,null,null,null,null,null,null,null,10,0,2,3,1,{"$f":"SQRT(J25^2+K25^2+L25^2)/M25","v":3.6055512754639891},0.13867504905630729,true]
[null,null,null,null,null,null,null,null,11,0,2,5,1,5.3851648071345037,9.284766908852593E-2,true]
[null,null,null,null,null,null,null,null,12,0,3,1,1,3.1622776601683795,0.31622776601683794,false]
[null,null,null,null,null,null,null,null,13,0,3,2,1,3.6055512754639891,0.13867504905630729,true]
[null,null,null,null,null,null,null,null,14,0,3,4,1,5,0.1,true]
[null,null,null,null,null,null,null,null,15,0,3,5,1,5.8309518948453007,0.17149858514250882,false]
{"$rows_left_out":162}
{"sheet":"fcc atoms","index":9,"n_rows":191,"n_cols":16,"rows_kept":191,"cut":false,"hidden":false,"merged":[]}
["fcc"]
[]
[]
[]
[]
[]
[]
[]
[]
[]
[]
[]
[]
[null,null,null,null,null,null,null,null,null,null,null,null,"atoms in","axis factor","plane factor"]
[null,null,null,null,null,null,null,null,null,"h","k ","l","row",null,null,"all odd?"]
[null,null,null,null,null,null,null,null,1,0,0,0,0,null,"all odd=1/sqrtsum squares, else 1/2sumsquares"]
[null,null,null,null,null,null,null,null,2,0,0,1,1,{"$f":"SQRT(J17^2+K17^2+L17^2)/M17","v":1},{"$f":"IF(P17,1/SQRT(J17^2+K17^2+L17^2),1/2/SQRT(J17^2+K17^2+L17^2))","v":0.5},{"$f":"ISODD(J17*K17*L17)","v":false}]
[null,null,null,null,null,null,null,null,3,0,1,0,1,1,{"$f":"IF(P18,1/SQRT(J18^2+K18^2+L18^2),1/2/SQRT(J18^2+K18^2+L18^2))","v":0.5},{"$f":"ISODD(J18*K18*L18)","v":false}]
[null,null,null,null,null,null,null,null,4,0,1,1,2,{"$f":"SQRT(J19^2+K19^2+L19^2)/M19","v":0.70710678118654757},{"$f":"IF(P19,1/SQRT(J19^2+K19^2+L19^2),1/2/SQRT(J19^2+K19^2+L19^2))","v":0.35355339059327373},false]
[null,null,null,null,null,null,null,null,5,0,1,2,1,{"$f":"SQRT(J20^2+K20^2+L20^2)/M20","v":2.2360679774997898},{"$f":"IF(P20,1/SQRT(J20^2+K20^2+L20^2),1/2/SQRT(J20^2+K20^2+L20^2))","v":0.22360679774997896},false]
[null,null,null,null,null,null,null,null,6,0,1,3,2,1.5811388300841898,0.15811388300841897,false]
[null,null,null,null,null,null,null,null,7,0,1,4,1,4.1231056256176606,0.12126781251816648,false]
[null,null,null,null,null,null,null,null,8,0,1,5,2,2.5495097567963922,9.8058067569092022E-2,false]
[null,null,null,null,null,null,null,null,9,0,2,1,1,2.2360679774997898,0.22360679774997896,false]
[null,null,null,null,null,null,null,null,10,0,2,3,1,3.6055512754639891,0.13867504905630729,false]
[null,null,null,null,null,null,null,null,11,0,2,5,1,5.3851648071345037,9.284766908852593E-2,false]
[null,null,null,null,null,null,null,null,12,0,3,1,2,1.5811388300841898,0.15811388300841897,false]
[null,null,null,null,null,null,null,null,13,0,3,2,1,3.6055512754639891,0.13867504905630729,false]
[null,null,null,null,null,null,null,null,14,0,3,4,1,5,0.1,false]
[null,null,null,null,null,null,null,null,15,0,3,5,2,2.9154759474226504,8.574929257125441E-2,false]
{"$rows_left_out":162}
{"sheet":"diamond atoms","index":10,"n_rows":191,"n_cols":15,"rows_kept":191,"cut":false,"hidden":false,"merged":[]}
["diamond"]
[]
[]
[]
[]
[]
[]
[]
[]
[]
[]
[]
[]
[null,null,null,null,null,null,null,null,null,null,null,null,"atoms in","axis factor","plane factor"]
[null,null,null,null,null,null,null,null,null,"h","k","l","row"]
[null,null,null,null,null,null,null,null,null,0,0,0,0,null,"1/2sqrt(i2 +j2+k2) or 1/4 for 100"]
[null,null,null,null,null,null,null,null,1,0,0,1,1,{"$f":"SQRT(J17^2+K17^2+L17^2)/M17","v":1},{"$f":"IF(J17+K17+L17=1,0.25,1/2/SQRT(J17^2+K17^2+L17^2))","v":0.25}]
[null,null,null,null,null,null,null,null,2,0,1,0,1,1,0.25]
[null,null,null,null,null,null,null,null,3,0,1,1,2,{"$f":"SQRT(J19^2+K19^2+L19^2)/M19","v":0.70710678118654757},{"$f":"IF(J19+K19+L19=1,0.25,1/2/SQRT(J19^2+K19^2+L19^2))","v":0.35355339059327373}]
[null,null,null,null,null,null,null,null,4,0,1,2,1,2.2360679774997898,{"$f":"IF(J20+K20+L20=1,0.25,1/2/SQRT(J20^2+K20^2+L20^2))","v":0.22360679774997896}]
[null,null,null,null,null,null,null,null,5,0,1,3,1,{"$f":"SQRT(J21^2+K21^2+L21^2)/M21","v":3.1622776601683795},{"$f":"IF(J21+K21+L21=1,0.25,1/2/SQRT(J21^2+K21^2+L21^2))","v":0.15811388300841897}]
[null,null,null,null,null,null,null,null,6,0,1,4,1,4.1231056256176606,0.12126781251816648]
[null,null,null,null,null,null,null,null,7,0,1,5,2,2.5495097567963922,{"$f":"IF(J23+K23+L23=1,0.25,1/2/SQRT(J23^2+K23^2+L23^2))","v":9.8058067569092022E-2}]
[null,null,null,null,null,null,null,null,8,0,2,1,1,2.2360679774997898,0.22360679774997896]
[null,null,null,null,null,null,null,null,9,0,2,3,1,3.6055512754639891,0.13867504905630729]
[null,null,null,null,null,null,null,null,10,0,2,5,1,5.3851648071345037,9.284766908852593E-2]
[null,null,null,null,null,null,null,null,11,0,3,1,1,3.1622776601683795,0.15811388300841897]
[null,null,null,null,null,null,null,null,12,0,3,2,1,3.6055512754639891,0.13867504905630729]
[null,null,null,null,null,null,null,null,13,0,3,4,1,5,0.1]
[null,null,null,null,null,null,null,null,14,0,3,5,1,5.8309518948453007,8.574929257125441E-2]
{"$rows_left_out":162}
{"sheet":"b","index":11,"n_rows":70,"n_cols":6,"rows_kept":70,"cut":false,"hidden":false,"merged":[]}
[null,"minimum impact parameter and calculation of recoil energy transferred to target atom along row"]
[]
[]
[]
[]
[]
[]
[]
[]
[]
[]
[]
[]
[]
[]
[]
[]
[]
[]
[]
[null,"Z1",14]
[null,"Z2",14]
[null,"e2",{"$f":"1.19995^2","v":1.4398800025000003},"MeV fm",{"$f":"+C23*0.00001","v":1.4398800025000003E-5},"MeV A"]
[null,"dR",5.43,"A"]
[null,"a",0.13800000000000001,"A"]
[null,"E",1,"MeV  "]
[]
[null,"alpha",{"$f":"+C21*C22*E23*C24/C25^2/C26","v":0.80468152124590431}]
[]
[null,"r-crit",{"$f":"2/3*C25*SQRT(C28)*(1-SQRT(C28)/19+C28/700)","v":7.8726235654453552E-2},null,"A"]
{"$rows_left_out":40}